{"text_format":"3","workbook":"xlsx","n_sheets":3,"sheets":["Sheet1","Sheet2","Sheet3"],"not_rendered":{"external_links":2,"defined_names":1},"read":"whole","date_system":"1900"}

{"sheet":"Sheet1","index":0,"n_rows":100,"n_cols":10,"rows_kept":100}
["学号","姓名","学生类别","专业代码","专业代码","导师","中期考核时间","中期考核地点","中期考核组成员","备注"]
["173750642","刘斌","全日制专业学位硕士生","085203","仪器仪表工程|085203","曹民","2019.6.4 9:00",940,"韩森，曹民，金涛，王皓宇"]
["173750661","蔡嘉诚","全日制专业学位硕士生","085203","仪器仪表工程|085203","曹民","2019.6.4 9:00",940,"韩森，曹民，金涛，王皓宇"]
["172430362","杜嘉","学术型硕士生","080402","测试计量技术及仪器","常敏","读博 不参加"]
["172550417","沈凯","学术型硕士生","081002","信号与信息处理","常敏","2019.5.29 13:00",928,"张荣福 张仁杰 常敏 马佩"]
["172550428","朱孟超",{"$f":"VLOOKUP(A6,[1]全日制硕士!$A:$F,3,FALSE)","v":"学术型硕士生"},{"$f":"VLOOKUP(A6,[1]全日制硕士!$A:$D,4,FALSE)","v":"081002"},{"$f":"VLOOKUP(A6,[1]全日制硕士!$A:$F,5,FALSE)","v":"信号与信息处理"},{"$f":"VLOOKUP(A6,[1]全日制硕士!$A:$F,6,FALSE)","v":"常敏"},"2019.5.29 8：40",734,"高秀敏 杨海马 李筠","高秀敏"]
["173750669","李柏萱","全日制专业学位硕士生","085203","仪器仪表工程|085203","常敏","2019.5.29 13:00",928,"张荣福 张仁杰 常敏 马佩"]
["172550412","廖登高","学术型硕士生","081002","信号与信息处理","陈麟","2019.5.28 9:30",305,"陈麟，臧小飞，游冠军，丁丽，袁明辉，谢静雅"]
["172550426","葛一凡","学术型硕士生","081002","信号与信息处理","陈麟","2019.5.28 9:30",305,"陈麟，臧小飞，游冠军，丁丽，袁明辉，谢静雅"]
["173750649","刘波","全日制专业学位硕士生","085203","仪器仪表工程|085203","陈麟","2019.5.28 9:30",305,"陈麟，臧小飞，游冠军，丁丽，袁明辉，谢静雅"]
["172550410","李伟","学术型硕士生","081002","信号与信息处理","陈青","2019.6.4 14:00",933,"秦川、陈青、姚恒、郭心悦、韩彦芳"]
["172550420","夏兰婷",{"$f":"VLOOKUP(A12,[1]全日制硕士!$A:$F,3,FALSE)","v":"学术型硕士生"},{"$f":"VLOOKUP(A12,[1]全日制硕士!$A:$D,4,FALSE)","v":"081002"},{"$f":"VLOOKUP(A12,[1]全日制硕士!$A:$F,5,FALSE)","v":"信号与信息处理"},{"$f":"VLOOKUP(A12,[1]全日制硕士!$A:$F,6,FALSE)","v":"陈青"},"2019.6.4 14:00",933,"秦川、陈青、姚恒、郭心悦、韩彦芳"]
["172550436","王宁","学术型硕士生","081002","信号与信息处理","陈青","2019.6.4 14:00",933,"秦川、陈青、姚恒、郭心悦、韩彦芳"]
["172550438","卜莹","学术型硕士生","081002","信号与信息处理","陈青","2019.6.4 14:00",933,"秦川、陈青、姚恒、郭心悦、韩彦芳"]
["172420341","邓富成","学术型硕士生","080401","精密仪器及机械","陈晓荣","2019.5.31 9:00",940,"华云松、施展、陈晓荣、刘宏业、范彦平"]
["172430366","刘亚茹","学术型硕士生","080402","测试计量技术及仪器","陈晓荣","2019.5.31 9:00",940,"华云松、施展、陈晓荣、刘宏业、范彦平"]
["172430367","李思宇","学术型硕士生","080402","测试计量技术及仪器","陈晓荣","2019.5.31 9:00",940,"华云松、施展、陈晓荣、刘宏业、范彦平"]
["173750652","石高辉","全日制专业学位硕士生","085203","仪器仪表工程|085203","陈晓荣","2019.5.31 9:00",940,"华云松、施展、陈晓荣、刘宏业、范彦平"]
["172550437","李伟","学术型硕士生","081002","信号与信息处理","戴博","2019.5.30 9:00",427,"戴博、李振庆、文静"]
["173750655","陈淑静","全日制专业学位硕士生","085203","仪器仪表工程|085203","戴博","2019.5.30 9:00",427,"戴博、李振庆、文静"]
["172430348","丁蒙","学术型硕士生","080402","测试计量技术及仪器","戴曙光","2019.6.5 13:00",940,"戴曙光、穆平安、金晅宏"]
["173750639","吉祥","全日制专业学位硕士生","085203","仪器仪表工程|085203","戴曙光","2019.6.5 13:00",940,"戴曙光、穆平安、金晅宏"]
["173750640","陆楷煜","全日制专业学位硕士生","085203","仪器仪表工程|085203","戴曙光","2019.6.5 13:00",940,"戴曙光、穆平安、金晅宏"]
["173750644","王雨","全日制专业学位硕士生","085203","仪器仪表工程|085203","戴曙光","2019.6.5 13:00",940,"戴曙光、穆平安、金晅宏"]
["173750653","程欢欢","全日制专业学位硕士生","085203","仪器仪表工程|085203","戴曙光","2019.6.5 13:00",940,"戴曙光、穆平安、金晅宏"]
["172430352","田泽懿","学术型硕士生","080402","测试计量技术及仪器","高秀敏","2019.5.29 8：40",734,"高秀敏 杨海马 李筠"]
["172430355","陈书行","学术型硕士生","080402","测试计量技术及仪器","高秀敏","2019.5.29 8：40",734,"高秀敏 杨海马 李筠"]
["173750654","何路遥","全日制专业学位硕士生","085203","仪器仪表工程|085203","高秀敏","2019.5.29 8：40",734,"高秀敏 杨海马 李筠"]
["172550423","黄绪发","学术型硕士生","081002","信号与信息处理","郭心悦","2019.6.4 14:00",933,"秦川、陈青、姚恒、郭心悦、韩彦芳"]
["172550433","张可儿","学术型硕士生","081002","信号与信息处理","郭心悦","2019.6.4 14:00",933,"秦川、陈青、姚恒、郭心悦、韩彦芳"]
["172420339","邱炯捷","学术型硕士生","080401","精密仪器及机械","韩森","2019.6.4 9:00",940,"韩森，曹民，金涛，王皓宇"]
["172420342","王乐蓉","学术型硕士生","080401","精密仪器及机械","韩森","2019.6.4 9:00",940,"韩森，曹民，金涛，王皓宇"]
["172420338","蓝畋","学术型硕士生","080401","精密仪器及机械","华云松","2019.5.31 9:00",940,"华云松、施展、陈晓荣、刘宏业、范彦平"]
["173750638","陈泽诣","全日制专业学位硕士生","085203","仪器仪表工程|085203","华云松","2019.5.31 9:00",940,"华云松、施展、陈晓荣、刘宏业、范彦平"]
["173750658","杨晨曦","全日制专业学位硕士生","085203","仪器仪表工程|085203","华云松","2019.5.31 9:00",940,"华云松、施展、陈晓荣、刘宏业、范彦平"]
["172430360","柳明","学术型硕士生","080402","测试计量技术及仪器","黄影平","2019.5.31 10:00",928,"黄影平 应捷 侯俊孙玉国"]
["172550413","胡福志","学术型硕士生","081002","信号与信息处理","黄影平","2019.5.31 10:10",928,"黄影平 应捷 侯俊孙玉国"]
["172550416","苏健鹏","学术型硕士生","081002","信号与信息处理","黄影平","2019.5.31 9:30",928,"黄影平 应捷 侯俊孙玉国"]
["172550434","仇旭阳","学术型硕士生","081002","信号与信息处理","黄影平","2019.5.31 9:40",928,"黄影平 应捷 侯俊孙玉国"]
["173750666","戴健","全日制专业学位硕士生","085203","仪器仪表工程|085203","黄影平","2019.5.31 9:50",928,"黄影平 应捷 侯俊孙玉国"]
["172420346","彭洋","学术型硕士生","080401","精密仪器及机械","金涛","2019.6.4 9:00",940,"韩森，曹民，金涛，王皓宇"]
["173750631","韩梦莹","全日制专业学位硕士生","085203","仪器仪表工程|085203","金涛","2019.6.4 9:00",940,"韩森，曹民，金涛，王皓宇"]
["173750636","邢志明","全日制专业学位硕士生","085203","仪器仪表工程|085203","金涛","2019.6.4 9:00",940,"韩森，曹民，金涛，王皓宇"]
["173750645","唐一揆","全日制专业学位硕士生","085203","仪器仪表工程|085203","金涛","2019.6.4 9:00",940,"韩森，曹民，金涛，王皓宇"]
["172550439","朱英亮","学术型硕士生","081002","信号与信息处理","金晅宏","2019.6.5 13:00",940,"戴曙光、穆平安、金晅宏"]
["173750641","韩悦","全日制专业学位硕士生","085203","仪器仪表工程|085203","金晅宏","2019.6.5 13:00",940,"戴曙光、穆平安、金晅宏"]
["172550429","田如安","学术型硕士生","081002","信号与信息处理","李筠","2019.5.29 8：40",734,"高秀敏 杨海马 李筠"]
["172550431","苏烨","学术型硕士生","081002","信号与信息处理","李筠","2019.5.29 8：40",734,"高秀敏 杨海马 李筠"]
["173750651","吴付峰","全日制专业学位硕士生","085203","仪器仪表工程|085203","李筠","2019.5.29 8：40",734,"高秀敏 杨海马 李筠"]
["172420345","孙嘉伟","学术型硕士生","080401","精密仪器及机械","马佩","2019.5.29 13:00",928,"张荣福 张仁杰 常敏 马佩"]
["172430351","徐磊","学术型硕士生","080402","测试计量技术及仪器","马佩","2019.5.29 13:00",928,"张荣福 张仁杰 常敏 马佩"]
["172430349","林玉莹","学术型硕士生","080402","测试计量技术及仪器","穆平安","2019.6.5 13:00",940,"戴曙光、穆平安、金晅宏"]
["172430361","郑娜","学术型硕士生","080402","测试计量技术及仪器","穆平安","2019.6.5 13:00",940,"戴曙光、穆平安、金晅宏"]
["172550415","胡蝶","学术型硕士生","081002","信号与信息处理","穆平安","2019.5.31 11:10",928,"黄影平 应捷 侯俊孙玉国","侯俊"]
["172550421","刘丽","学术型硕士生","081002","信号与信息处理","穆平安","2019.6.5 13:00",940,"戴曙光、穆平安、金晅宏"]
["173750646","周森鹏","全日制专业学位硕士生","085203","仪器仪表工程|085203","穆平安","2019.6.5 13:00",940,"戴曙光、穆平安、金晅宏"]
["173750668","梁建豪","全日制专业学位硕士生","085203","仪器仪表工程|085203","穆平安","2019.6.5 13:00",940,"戴曙光、穆平安、金晅宏"]
["172550411","钱肖康","学术型硕士生","081002","信号与信息处理","秦川","2019.6.4 14:00",933,"秦川、陈青、姚恒、郭心悦、韩彦芳"]
["172550418","胡叶岑","学术型硕士生","081002","信号与信息处理","秦川","2019.6.4 14:00",933,"秦川、陈青、姚恒、郭心悦、韩彦芳"]
["172550419","莫群","学术型硕士生","081002","信号与信息处理","秦川","2019.6.4 14:00",933,"秦川、陈青、姚恒、郭心悦、韩彦芳"]
["173750633","付钰倢","全日制专业学位硕士生","085203","仪器仪表工程|085203","秦川","2019.6.4 14:00",933,"秦川、陈青、姚恒、郭心悦、韩彦芳"]
["173750634","朱洺征","全日制专业学位硕士生","085203","仪器仪表工程|085203","沈昱明","2019.5.29 13:30",938,"沈昱明，于莲芝，陈胜，汪正祥，肖儿良，左小五，唐春辉"]
["173750648","刘若璇","全日制专业学位硕士生","085203","仪器仪表工程|085203","沈昱明","2019.5.29 13:30",938,"沈昱明，于莲芝，陈胜，汪正祥，肖儿良，左小五，唐春辉"]
["173750659","古清枢",{"$f":"VLOOKUP(A64,[2]全日制硕士!$A:$F,3,FALSE)","v":"全日制专业学位硕士生"},{"$f":"VLOOKUP(A64,[2]全日制硕士!$A:$D,4,FALSE)","v":"085203"},{"$f":"VLOOKUP(A64,[2]全日制硕士!$A:$F,5,FALSE)","v":"仪器仪表工程|085203"},{"$f":"VLOOKUP(A64,[2]全日制硕士!$A:$F,6,FALSE)","v":"沈昱明"},"2019.5.29 13:30",938,"沈昱明，于莲芝，陈胜，汪正祥，肖儿良，左小五，唐春辉"]
["172430356","汤卓","学术型硕士生","080402","测试计量技术及仪器","施伟斌","2019.6.4 16:00",933,"施伟斌，秦川，袁明辉，乐燕芬，苏胜君，李瑞祥"]
["172430363","康颜爽","学术型硕士生","080402","测试计量技术及仪器","施伟斌","2019.6.4 16:00",933,"施伟斌，秦川，袁明辉，乐燕芬，苏胜君，李瑞祥"]
["172550424","罗力源","学术型硕士生","081002","信号与信息处理","施伟斌","2019.6.4 16:00",933,"施伟斌，秦川，袁明辉，乐燕芬，苏胜君，李瑞祥"]
["172550425","洪奇峰",{"$f":"VLOOKUP(A68,[1]全日制硕士!$A:$F,3,FALSE)","v":"学术型硕士生"},{"$f":"VLOOKUP(A68,[1]全日制硕士!$A:$D,4,FALSE)","v":"081002"},{"$f":"VLOOKUP(A68,[1]全日制硕士!$A:$F,5,FALSE)","v":"信号与信息处理"},{"$f":"VLOOKUP(A68,[1]全日制硕士!$A:$F,6,FALSE)","v":"施伟斌"},"2019.6.4 16:00",933,"施伟斌，秦川，袁明辉，乐燕芬，苏胜君，李瑞祥"]
["172550430","吴迪",{"$f":"VLOOKUP(A69,[1]全日制硕士!$A:$F,3,FALSE)","v":"学术型硕士生"},{"$f":"VLOOKUP(A69,[1]全日制硕士!$A:$D,4,FALSE)","v":"081002"},{"$f":"VLOOKUP(A69,[1]全日制硕士!$A:$F,5,FALSE)","v":"信号与信息处理"},{"$f":"VLOOKUP(A69,[1]全日制硕士!$A:$F,6,FALSE)","v":"施伟斌"},"2019.6.4 16:00",933,"施伟斌，秦川，袁明辉，乐燕芬，苏胜君，李瑞祥"]
["172550435","赵东方","学术型硕士生","081002","信号与信息处理","施伟斌","2019.6.4 16:00",933,"施伟斌，秦川，袁明辉，乐燕芬，苏胜君，李瑞祥"]
["173750660","汤家森","全日制专业学位硕士生","085203","仪器仪表工程|085203","施伟斌","2019.6.4 16:00",933,"施伟斌，秦川，袁明辉，乐燕芬，苏胜君，李瑞祥"]
["172420340","韩雪飞","学术型硕士生","080401","精密仪器及机械","施展","病休一学期"]
["172430354","张雨杨",{"$f":"VLOOKUP(A73,[1]全日制硕士!$A:$F,3,FALSE)","v":"学术型硕士生"},{"$f":"VLOOKUP(A73,[1]全日制硕士!$A:$D,4,FALSE)","v":"080402"},{"$f":"VLOOKUP(A73,[1]全日制硕士!$A:$F,5,FALSE)","v":"测试计量技术及仪器"},{"$f":"VLOOKUP(A73,[1]全日制硕士!$A:$F,6,FALSE)","v":"施展"},"2019.5.31 9:00",940,"华云松、施展、陈晓荣、刘宏业、范彦平"]
["172420344","刘慧颖","学术型硕士生","080401","精密仪器及机械","孙玉国","2019.5.31 10:20",928,"黄影平 应捷 侯俊孙玉国"]
["172430350","吴立鑫","学术型硕士生","080402","测试计量技术及仪器","孙玉国","2019.5.31 10:30",928,"黄影平 应捷 侯俊孙玉国"]
["172430364","吕斌","学术型硕士生","080402","测试计量技术及仪器","孙玉国","2019.5.31 10:40",928,"黄影平 应捷 侯俊孙玉国"]
["172430357","张磊","学术型硕士生","080402","测试计量技术及仪器","唐春晖","2019.5.29 8：40",734,"高秀敏 杨海马 李筠"]
["172550427","姜珊珊","学术型硕士生","081002","信号与信息处理","王凯民","2019.5.30 9:00",427,"戴博、李振庆、文静"]
["173750667","梁嘉元","全日制专业学位硕士生","085203","仪器仪表工程|085203","王巍琳"]
[152510360,"司广文","学术型硕士生","081002","信号与信息处理","徐伯庆","2019.6.4 14:00",933,"秦川、陈青、姚恒、郭心悦、韩彦芳"]
["172430358","谢孟涛","学术型硕士生","080402","测试计量技术及仪器","杨海马","2019.5.29 8：40",734,"高秀敏 杨海马 李筠"]
["173750662","欧继","全日制专业学位硕士生","085203","仪器仪表工程|085203","杨海马","2019.5.29 8：40",734,"高秀敏 杨海马 李筠"]
["172420347","张言杰","学术型硕士生","080401","精密仪器及机械","杨晖","2019.6.6 9:00",940,"杨晖，陈晓荣，华云松，刘宏业"]
["173750643","朱永海","全日制专业学位硕士生","085203","仪器仪表工程|085203","杨晖","2019.6.6 9:00",940,"杨晖，陈晓荣，华云松，刘宏业"]
["173750657","牟士杭","全日制专业学位硕士生","085203","仪器仪表工程|085203","杨晖","2019.6.6 9:00",940,"杨晖，陈晓荣，华云松，刘宏业"]
["173750663","李宜璋","全日制专业学位硕士生","085203","仪器仪表工程|085203","杨晖","2019.6.6 9:00",940,"杨晖，陈晓荣，华云松，刘宏业"]
["173750664","王必得","全日制专业学位硕士生","085203","仪器仪表工程|085203","杨晖","2019.6.6 9:00",940,"杨晖，陈晓荣，华云松，刘宏业"]
["173750665","宋健","全日制专业学位硕士生","085203","仪器仪表工程|085203","杨晖","2019.6.6 9:00",940,"杨晖，陈晓荣，华云松，刘宏业"]
["172430359","刘聪聪","学术型硕士生","080402","测试计量技术及仪器","应捷","2019.5.31 10:50",928,"黄影平 应捷 侯俊孙玉国"]
["173750650","吴倩",{"$f":"VLOOKUP(A90,[2]全日制硕士!$A:$F,3,FALSE)","v":"全日制专业学位硕士生"},{"$f":"VLOOKUP(A90,[2]全日制硕士!$A:$D,4,FALSE)","v":"085203"},{"$f":"VLOOKUP(A90,[2]全日制硕士!$A:$F,5,FALSE)","v":"仪器仪表工程|085203"},{"$f":"VLOOKUP(A90,[2]全日制硕士!$A:$F,6,FALSE)","v":"应捷"},"2019.5.31 11:00",928,"黄影平 应捷 侯俊孙玉国"]
["172430365","胡成伟","学术型硕士生","080402","测试计量技术及仪器","袁明辉","2019.5.28 9:30",305,"陈麟，臧小飞，游冠军，丁丽，袁明辉，谢静雅"]
["172550414","陈亚敏","学术型硕士生","081002","信号与信息处理","袁明辉","2019.5.28 9:30",305,"陈麟，臧小飞，游冠军，丁丽，袁明辉，谢静雅"]
["172550422","刘照邦","学术型硕士生","081002","信号与信息处理","袁明辉","2019.5.28 9:30",305,"陈麟，臧小飞，游冠军，丁丽，袁明辉，谢静雅"]
["172559001","ISMAGULOV DAUREN","学术型硕士生","081002","信号与信息处理","袁明辉","2019.5.28 9:30",305,"陈麟，臧小飞，游冠军，丁丽，袁明辉，谢静雅"]
["172420343","朱敏","学术型硕士生","080401","精密仪器及机械","张荣福","2019.5.29 13:00",928,"张荣福 张仁杰 常敏 马佩"]
["172430353","赵昊晨","学术型硕士生","080402","测试计量技术及仪器","张荣福","2019.5.29 13:00",928,"张荣福 张仁杰 常敏 马佩"]
["173750632","马俊","全日制专业学位硕士生","085203","仪器仪表工程|085203","张荣福","2019.5.29 13:00",928,"张荣福 张仁杰 常敏 马佩"]
["173750635","魏剑飞","全日制专业学位硕士生","085203","仪器仪表工程|085203","张荣福","2019.5.29 13:00",928,"张荣福 张仁杰 常敏 马佩"]
["173750637","裴茂印","全日制专业学位硕士生","085203","仪器仪表工程|085203","张荣福","2019.5.29 13:00",928,"张荣福 张仁杰 常敏 马佩"]
["173750656","邓相舟","全日制专业学位硕士生","085203","仪器仪表工程|085203","张荣福","2019.5.29 13:00",928,"张荣福 张仁杰 常敏 马佩"]

{"sheet":"Sheet2","index":1,"n_rows":0,"n_cols":0,"rows_kept":0}

{"sheet":"Sheet3","index":2,"n_rows":0,"n_cols":0,"rows_kept":0}